{"text_format":"1","workbook":"xlsx","n_sheets":2,"sheets":["RMI","Índices INSS"],"not_rendered":{"charts":0,"images":1,"macros":1,"external_links":0,"defined_names":6,"comments":0,"pivot_tables":0},"unopened":[],"bounds":{"document_bytes":16777216,"sheet_cells":100000,"rows_first":2000,"rows_last":500,"rows_between":2000,"halvings":0,"cell_chars":16384,"cell_head_chars":4096},"cells_cut":0,"cells_raw":0,"read":"whole","date_system":"1900"}

{"sheet":"RMI","index":0,"n_rows":658,"n_cols":9,"rows_kept":658,"cut":false,"hidden":false,"merged":[[7,8,7,9],[9,8,9,9],[10,8,10,9],[9,3,9,4],[4,2,7,6],[652,3,652,4],[653,3,653,4],[654,3,654,4],[655,3,655,4],[656,3,656,4],[647,3,647,4],[648,3,648,4],[649,3,649,4],[650,3,650,4],[651,3,651,4],[642,3,642,4],[643,3,643,4],[644,3,644,4],[645,3,645,4],[646,3,646,4],[637,3,637,4],[638,3,638,4],[639,3,639,4],[640,3,640,4],[641,3,641,4],[632,3,632,4],[633,3,633,4],[634,3,634,4],[635,3,635,4],[636,3,636,4],[627,3,627,4],[628,3,628,4],[629,3,629,4],[630,3,630,4],[631,3,631,4],[622,3,622,4],[623,3,623,4],[624,3,624,4],[625,3,625,4],[626,3,626,4],[617,3,617,4],[618,3,618,4],[619,3,619,4],[620,3,620,4],[621,3,621,4],[612,3,612,4],[613,3,613,4],[614,3,614,4],[615,3,615,4],[616,3,616,4],[607,3,607,4],[608,3,608,4],[609,3,609,4],[610,3,610,4],[611,3,611,4],[602,3,602,4],[603,3,603,4],[604,3,604,4],[605,3,605,4],[606,3,606,4],[597,3,597,4],[598,3,598,4],[599,3,599,4],[600,3,600,4],[601,3,601,4],[592,3,592,4],[593,3,593,4],[594,3,594,4],[595,3,595,4],[596,3,596,4],[587,3,587,4],[588,3,588,4],[589,3,589,4],[590,3,590,4],[591,3,591,4],[582,3,582,4],[583,3,583,4],[584,3,584,4],[585,3,585,4],[586,3,586,4],[577,3,577,4],[578,3,578,4],[579,3,579,4],[580,3,580,4],[581,3,581,4],[572,3,572,4],[573,3,573,4],[574,3,574,4],[575,3,575,4],[576,3,576,4],[567,3,567,4],[568,3,568,4],[569,3,569,4],[570,3,570,4],[571,3,571,4],[562,3,562,4],[563,3,563,4],[564,3,564,4],[565,3,565,4],[566,3,566,4],[557,3,557,4],[558,3,558,4],[559,3,559,4],[560,3,560,4],[561,3,561,4],[552,3,552,4],[553,3,553,4],[554,3,554,4],[555,3,555,4],[556,3,556,4],[547,3,547,4],[548,3,548,4],[549,3,549,4],[550,3,550,4],[551,3,551,4],[542,3,542,4],[543,3,543,4],[544,3,544,4],[545,3,545,4],[546,3,546,4],[537,3,537,4],[538,3,538,4],[539,3,539,4],[540,3,540,4],[541,3,541,4],[532,3,532,4],[533,3,533,4],[534,3,534,4],[535,3,535,4],[536,3,536,4],[527,3,527,4],[528,3,528,4],[529,3,529,4],[530,3,530,4],[531,3,531,4],[522,3,522,4],[523,3,523,4],[524,3,524,4],[525,3,525,4],[526,3,526,4],[517,3,517,4],[518,3,518,4],[519,3,519,4],[520,3,520,4],[521,3,521,4],[512,3,512,4],[513,3,513,4],[514,3,514,4],[515,3,515,4],[516,3,516,4],[507,3,507,4],[508,3,508,4],[509,3,509,4],[510,3,510,4],[511,3,511,4],[502,3,502,4],[503,3,503,4],[504,3,504,4],[505,3,505,4],[506,3,506,4],[497,3,497,4],[498,3,498,4],[499,3,499,4],[500,3,500,4],[501,3,501,4],[492,3,492,4],[493,3,493,4],[494,3,494,4],[495,3,495,4],[496,3,496,4],[487,3,487,4],[488,3,488,4],[489,3,489,4],[490,3,490,4],[491,3,491,4],[482,3,482,4],[483,3,483,4],[484,3,484,4],[485,3,485,4],[486,3,486,4],[477,3,477,4],[478,3,478,4],[479,3,479,4],[480,3,480,4],[481,3,481,4],[472,3,472,4],[473,3,473,4],[474,3,474,4],[475,3,475,4],[476,3,476,4],[467,3,467,4],[468,3,468,4],[469,3,469,4],[470,3,470,4],[471,3,471,4],[462,3,462,4],[463,3,463,4],[464,3,464,4],[465,3,465,4],[466,3,466,4],[457,3,457,4],[458,3,458,4],[459,3,459,4],[460,3,460,4],[461,3,461,4],[452,3,452,4],[453,3,453,4],[454,3,454,4],[455,3,455,4],[456,3,456,4],[447,3,447,4],[448,3,448,4],[449,3,449,4],[450,3,450,4],[451,3,451,4],[442,3,442,4],[443,3,443,4],[444,3,444,4],[445,3,445,4],[446,3,446,4],[437,3,437,4],[438,3,438,4],[439,3,439,4],[440,3,440,4],[441,3,441,4],[432,3,432,4],[433,3,433,4],[434,3,434,4],[435,3,435,4],[436,3,436,4],[427,3,427,4],[428,3,428,4],[429,3,429,4],[430,3,430,4],[431,3,431,4],[422,3,422,4],[423,3,423,4],[424,3,424,4],[425,3,425,4],[426,3,426,4],[417,3,417,4],[418,3,418,4],[419,3,419,4],[420,3,420,4],[421,3,421,4],[412,3,412,4],[413,3,413,4],[414,3,414,4],[415,3,415,4],[416,3,416,4],[407,3,407,4],[408,3,408,4],[409,3,409,4],[410,3,410,4],[411,3,411,4],[402,3,402,4],[403,3,403,4],[404,3,404,4],[405,3,405,4],[406,3,406,4],[397,3,397,4],[398,3,398,4],[399,3,399,4],[400,3,400,4],[401,3,401,4],[392,3,392,4],[393,3,393,4],[394,3,394,4],[395,3,395,4],[396,3,396,4],[387,3,387,4],[388,3,388,4],[389,3,389,4],[390,3,390,4],[391,3,391,4],[382,3,382,4],[383,3,383,4],[384,3,384,4],[385,3,385,4],[386,3,386,4],[0,2,0,6],[2,3,2,4],[357,3,357,4],[358,3,358,4],[359,3,359,4],[360,3,360,4],[361,3,361,4],[10,3,10,4],[353,3,353,4],[354,3,354,4],[355,3,355,4],[356,3,356,4],[30,3,30,4],[31,3,31,4],[32,3,32,4],[33,3,33,4],[34,3,34,4],[35,3,35,4],[36,3,36,4],[37,3,37,4],[38,3,38,4],[39,3,39,4],[40,3,40,4],[41,3,41,4],[367,3,367,4],[368,3,368,4],[369,3,369,4],[370,3,370,4],[371,3,371,4],[11,3,11,4],[12,3,12,4],[13,3,13,4],[14,3,14,4],[15,3,15,4],[16,3,16,4],[17,3,17,4],[18,3,18,4],[19,3,19,4],[20,3,20,4],[21,3,21,4],[22,3,22,4],[23,3,23,4],[24,3,24,4],[25,3,25,4],[26,3,26,4],[27,3,27,4],[28,3,28,4],[29,3,29,4],[42,3,42,4],[43,3,43,4],[44,3,44,4],[45,3,45,4],[46,3,46,4],[47,3,47,4],[48,3,48,4],[49,3,49,4],[50,3,50,4],[51,3,51,4],[52,3,52,4],[53,3,53,4],[54,3,54,4],[55,3,55,4],[56,3,56,4],[57,3,57,4],[58,3,58,4],[59,3,59,4],[60,3,60,4],[61,3,61,4],[62,3,62,4],[63,3,63,4],[64,3,64,4],[65,3,65,4],[66,3,66,4],[67,3,67,4],[68,3,68,4],[69,3,69,4],[70,3,70,4],[71,3,71,4],[72,3,72,4],[73,3,73,4],[74,3,74,4],[75,3,75,4],[76,3,76,4],[77,3,77,4],[78,3,78,4],[79,3,79,4],[80,3,80,4],[81,3,81,4],[82,3,82,4],[83,3,83,4],[84,3,84,4],[85,3,85,4],[86,3,86,4],[87,3,87,4],[88,3,88,4],[89,3,89,4],[90,3,90,4],[91,3,91,4],[92,3,92,4],[93,3,93,4],[94,3,94,4],[95,3,95,4],[96,3,96,4],[97,3,97,4],[98,3,98,4],[99,3,99,4],[100,3,100,4],[101,3,101,4],[102,3,102,4],[103,3,103,4],[104,3,104,4],[105,3,105,4],[106,3,106,4],[107,3,107,4],[108,3,108,4],[109,3,109,4],[110,3,110,4],[111,3,111,4],[112,3,112,4],[113,3,113,4],[114,3,114,4],[115,3,115,4],[116,3,116,4],[117,3,117,4],[118,3,118,4],[119,3,119,4],[120,3,120,4],[121,3,121,4],[122,3,122,4],[123,3,123,4],[124,3,124,4],[125,3,125,4],[126,3,126,4],[127,3,127,4],[128,3,128,4],[129,3,129,4],[130,3,130,4],[131,3,131,4],[132,3,132,4],[133,3,133,4],[134,3,134,4],[135,3,135,4],[136,3,136,4],[137,3,137,4],[138,3,138,4],[139,3,139,4],[140,3,140,4],[141,3,141,4],[142,3,142,4],[143,3,143,4],[144,3,144,4],[145,3,145,4],[146,3,146,4],[147,3,147,4],[148,3,148,4],[149,3,149,4],[150,3,150,4],[151,3,151,4],[152,3,152,4],[153,3,153,4],[154,3,154,4],[155,3,155,4],[156,3,156,4],[157,3,157,4],[158,3,158,4],[159,3,159,4],[160,3,160,4],[161,3,161,4],[162,3,162,4],[163,3,163,4],[164,3,164,4],[165,3,165,4],[166,3,166,4],[167,3,167,4],[168,3,168,4],[169,3,169,4],[170,3,170,4],[171,3,171,4],[172,3,172,4],[173,3,173,4],[174,3,174,4],[175,3,175,4],[176,3,176,4],[177,3,177,4],[178,3,178,4],[179,3,179,4],[180,3,180,4],[181,3,181,4],[182,3,182,4],[183,3,183,4],[184,3,184,4],[185,3,185,4],[186,3,186,4],[187,3,187,4],[188,3,188,4],[189,3,189,4],[190,3,190,4],[191,3,191,4],[192,3,192,4],[193,3,193,4],[194,3,194,4],[195,3,195,4],[196,3,196,4],[197,3,197,4],[198,3,198,4],[199,3,199,4],[200,3,200,4],[201,3,201,4],[202,3,202,4],[203,3,203,4],[204,3,204,4],[205,3,205,4],[206,3,206,4],[207,3,207,4],[208,3,208,4],[209,3,209,4],[210,3,210,4],[211,3,211,4],[212,3,212,4],[213,3,213,4],[214,3,214,4],[215,3,215,4],[216,3,216,4],[217,3,217,4],[218,3,218,4],[219,3,219,4],[220,3,220,4],[221,3,221,4],[222,3,222,4],[223,3,223,4],[224,3,224,4],[225,3,225,4],[226,3,226,4],[227,3,227,4],[228,3,228,4],[229,3,229,4],[230,3,230,4],[231,3,231,4],[232,3,232,4],[233,3,233,4],[234,3,234,4],[235,3,235,4],[236,3,236,4],[237,3,237,4],[238,3,238,4],[239,3,239,4],[240,3,240,4],[241,3,241,4],[242,3,242,4],[243,3,243,4],[244,3,244,4],[245,3,245,4],[246,3,246,4],[247,3,247,4],[248,3,248,4],[249,3,249,4],[250,3,250,4],[251,3,251,4],[252,3,252,4],[253,3,253,4],[254,3,254,4],[255,3,255,4],[256,3,256,4],[257,3,257,4],[258,3,258,4],[259,3,259,4],[260,3,260,4],[261,3,261,4],[262,3,262,4],[263,3,263,4],[264,3,264,4],[265,3,265,4],[266,3,266,4],[267,3,267,4],[268,3,268,4],[269,3,269,4],[270,3,270,4],[271,3,271,4],[272,3,272,4],[273,3,273,4],[274,3,274,4],[275,3,275,4],[276,3,276,4],[277,3,277,4],[278,3,278,4],[279,3,279,4],[280,3,280,4],[281,3,281,4],[282,3,282,4],[283,3,283,4],[284,3,284,4],[285,3,285,4],[286,3,286,4],[287,3,287,4],[288,3,288,4],[289,3,289,4],[301,3,301,4],[302,3,302,4],[303,3,303,4],[304,3,304,4],[305,3,305,4],[306,3,306,4],[307,3,307,4],[290,3,290,4],[291,3,291,4],[292,3,292,4],[293,3,293,4],[294,3,294,4],[295,3,295,4],[296,3,296,4],[297,3,297,4],[298,3,298,4],[349,3,349,4],[350,3,350,4],[351,3,351,4],[352,3,352,4],[335,3,335,4],[336,3,336,4],[337,3,337,4],[338,3,338,4],[339,3,339,4],[340,3,340,4],[341,3,341,4],[342,3,342,4],[343,3,343,4],[344,3,344,4],[323,3,323,4],[324,3,324,4],[325,3,325,4],[308,3,308,4],[309,3,309,4],[310,3,310,4],[348,3,348,4],[347,3,347,4],[346,3,346,4],[345,3,345,4],[331,3,331,4],[330,3,330,4],[329,3,329,4],[328,3,328,4],[327,3,327,4],[326,3,326,4],[311,3,311,4],[312,3,312,4],[313,3,313,4],[314,3,314,4],[315,3,315,4],[316,3,316,4],[322,3,322,4],[321,3,321,4],[320,3,320,4],[319,3,319,4],[318,3,318,4],[317,3,317,4],[299,3,299,4],[300,3,300,4],[381,3,381,4],[372,3,372,4],[373,3,373,4],[374,3,374,4],[375,3,375,4],[376,3,376,4],[334,3,334,4],[333,3,333,4],[332,3,332,4],[362,3,362,4],[363,3,363,4],[364,3,364,4],[365,3,365,4],[366,3,366,4],[377,3,377,4],[378,3,378,4],[379,3,379,4],[380,3,380,4]]}
[null,null,"Relatório de Salários de Contribuição - INSS"]
[]
[null,null,"DIB:","2019-11-13"]
[]
[null,null,"Correção Monetária dos salários-de-contribuição pela OTNBTN ATÉ 09/1988, INPC ATÉ 12/1992, IRSM ATÉ 02/1994, URV PBC ATÉ 06/1994, IPCR ATÉ 06/1995, INPC ATÉ 03/1996, IGPDI ATÉ 02/1999, IGPM ATÉ 05/2004, INPC ATÉ 12/2050"]
[]
[]
[null,null,null,null,null,null,null,null,"Siga as redes Sociais da ABLCALC"]
[]
[null,null,"Teto INSS","Salário Mínimo",null,"Data","Índices",null,"@giovannimds"]
[null,null,765000,66000,null,"1966-01-01",{"$f":"'Índices INSS'!$E$1/VLOOKUP(F11,'Índices INSS'!A:D,4,1)","v":5.8063530491069071E-3},null,"@ablcalc"]
[null,null,765000,66000,null,"1966-02-01",{"$f":"'Índices INSS'!$E$1/VLOOKUP(F12,'Índices INSS'!A:D,4,1)","v":5.5077404366282766E-3}]
[null,null,765000,84000,null,"1966-03-01",{"$f":"'Índices INSS'!$E$1/VLOOKUP(F13,'Índices INSS'!A:D,4,1)","v":5.5714138974972136E-3}]
[null,null,765000,84000,null,"1966-04-01",{"$f":"'Índices INSS'!$E$1/VLOOKUP(F14,'Índices INSS'!A:D,4,1)","v":5.4764468329667375E-3}]
[null,null,765000,84000,null,"1966-05-01",{"$f":"'Índices INSS'!$E$1/VLOOKUP(F15,'Índices INSS'!A:D,4,1)","v":5.2727276195661324E-3}]
[null,null,765000,84000,null,"1966-06-01",{"$f":"'Índices INSS'!$E$1/VLOOKUP(F16,'Índices INSS'!A:D,4,1)","v":5.0490027724183354E-3}]
[null,null,765000,84000,null,"1966-07-01",{"$f":"'Índices INSS'!$E$1/VLOOKUP(F17,'Índices INSS'!A:D,4,1)","v":4.8508033147025712E-3}]
[null,null,765000,84000,null,"1966-08-01",{"$f":"'Índices INSS'!$E$1/VLOOKUP(F18,'Índices INSS'!A:D,4,1)","v":4.7178395004922975E-3}]
[null,null,765000,84000,null,"1966-09-01",{"$f":"'Índices INSS'!$E$1/VLOOKUP(F19,'Índices INSS'!A:D,4,1)","v":4.5875993888817015E-3}]
[null,null,765000,84000,null,"1966-10-01",{"$f":"'Índices INSS'!$E$1/VLOOKUP(F20,'Índices INSS'!A:D,4,1)","v":4.4602251705073859E-3}]
[null,null,765000,84000,null,"1966-11-01",{"$f":"'Índices INSS'!$E$1/VLOOKUP(F21,'Índices INSS'!A:D,4,1)","v":4.3456025166075827E-3}]
[null,null,765000,84000,null,"1966-12-01",{"$f":"'Índices INSS'!$E$1/VLOOKUP(F22,'Índices INSS'!A:D,4,1)","v":4.2479269585018785E-3}]
[null,null,765000,84000,null,"1967-01-01",{"$f":"'Índices INSS'!$E$1/VLOOKUP(F23,'Índices INSS'!A:D,4,1)","v":4.1491806091839105E-3}]
[null,null,765,84,null,"1967-02-01",{"$f":"'Índices INSS'!$E$1/VLOOKUP(F24,'Índices INSS'!A:D,4,1)","v":4.053215463896068}]
[null,null,1050,105,null,"1967-03-01",{"$f":"'Índices INSS'!$E$1/VLOOKUP(F25,'Índices INSS'!A:D,4,1)","v":3.9697471630706285}]
[null,null,1050,105,null,"1967-04-01",{"$f":"'Índices INSS'!$E$1/VLOOKUP(F26,'Índices INSS'!A:D,4,1)","v":3.9117476802160653}]
[null,null,1050,105,null,"1967-05-01",{"$f":"'Índices INSS'!$E$1/VLOOKUP(F27,'Índices INSS'!A:D,4,1)","v":3.8538770910415674}]
[null,null,1050,105,null,"1967-06-01",{"$f":"'Índices INSS'!$E$1/VLOOKUP(F28,'Índices INSS'!A:D,4,1)","v":3.7857606566977364}]
[null,null,1050,105,null,"1967-07-01",{"$f":"'Índices INSS'!$E$1/VLOOKUP(F29,'Índices INSS'!A:D,4,1)","v":3.6816448449752888}]
[null,null,1050,105,null,"1967-08-01",{"$f":"'Índices INSS'!$E$1/VLOOKUP(F30,'Índices INSS'!A:D,4,1)","v":3.5911125387618483}]
[null,null,1050,105,null,"1967-09-01",{"$f":"'Índices INSS'!$E$1/VLOOKUP(F31,'Índices INSS'!A:D,4,1)","v":3.5370811482652926}]
[null,null,1050,105,null,"1967-10-01",{"$f":"'Índices INSS'!$E$1/VLOOKUP(F32,'Índices INSS'!A:D,4,1)","v":3.5202872658349005}]
[null,null,1050,105,null,"1967-11-01",{"$f":"'Índices INSS'!$E$1/VLOOKUP(F33,'Índices INSS'!A:D,4,1)","v":3.496026936511671}]
[null,null,1050,105,null,"1967-12-01",{"$f":"'Índices INSS'!$E$1/VLOOKUP(F34,'Índices INSS'!A:D,4,1)","v":3.4472626485379823}]
[null,null,1050,105,null,"1968-01-01",{"$f":"'Índices INSS'!$E$1/VLOOKUP(F35,'Índices INSS'!A:D,4,1)","v":3.3843210457295054}]
[null,null,1050,105,null,"1968-02-01",{"$f":"'Índices INSS'!$E$1/VLOOKUP(F36,'Índices INSS'!A:D,4,1)","v":3.3259303473650945}]
[null,null,1050,129.6,null,"1968-03-01",{"$f":"'Índices INSS'!$E$1/VLOOKUP(F37,'Índices INSS'!A:D,4,1)","v":3.2784169068179634}]
[null,null,1176,129.6,null,"1968-04-01",{"$f":"'Índices INSS'!$E$1/VLOOKUP(F38,'Índices INSS'!A:D,4,1)","v":3.2311583085134759}]
[null,null,1176,129.6,null,"1968-05-01",{"$f":"'Índices INSS'!$E$1/VLOOKUP(F39,'Índices INSS'!A:D,4,1)","v":3.1716172212570943}]
[null,null,1176,129.6,null,"1968-06-01",{"$f":"'Índices INSS'!$E$1/VLOOKUP(F40,'Índices INSS'!A:D,4,1)","v":3.0892771721492149}]
[null,null,1176,129.6,null,"1968-07-01",{"$f":"'Índices INSS'!$E$1/VLOOKUP(F41,'Índices INSS'!A:D,4,1)","v":3.0035977443334567}]
[null,null,1176,129.6,null,"1968-08-01",{"$f":"'Índices INSS'!$E$1/VLOOKUP(F42,'Índices INSS'!A:D,4,1)","v":2.9376851953733838}]
[null,null,1176,129.6,null,"1968-09-01",{"$f":"'Índices INSS'!$E$1/VLOOKUP(F43,'Índices INSS'!A:D,4,1)","v":2.8849282244402228}]
[null,null,1176,129.6,null,"1968-10-01",{"$f":"'Índices INSS'!$E$1/VLOOKUP(F44,'Índices INSS'!A:D,4,1)","v":2.8449072078037232}]
[null,null,1176,129.6,null,"1968-11-01",{"$f":"'Índices INSS'!$E$1/VLOOKUP(F45,'Índices INSS'!A:D,4,1)","v":2.8027176192099934}]
[null,null,1176,129.6,null,"1968-12-01",{"$f":"'Índices INSS'!$E$1/VLOOKUP(F46,'Índices INSS'!A:D,4,1)","v":2.7578099928484474}]
[null,null,1176,129.6,null,"1969-01-01",{"$f":"'Índices INSS'!$E$1/VLOOKUP(F47,'Índices INSS'!A:D,4,1)","v":2.7059366461543397}]
[null,null,1176,129.6,null,"1969-02-01",{"$f":"'Índices INSS'!$E$1/VLOOKUP(F48,'Índices INSS'!A:D,4,1)","v":2.6574430931027817}]
[null,null,1176,129.6,null,"1969-03-01",{"$f":"'Índices INSS'!$E$1/VLOOKUP(F49,'Índices INSS'!A:D,4,1)","v":2.6113645215738033}]
[null,null,1176,129.6,null,"1969-04-01",{"$f":"'Índices INSS'!$E$1/VLOOKUP(F50,'Índices INSS'!A:D,4,1)","v":2.5750859383485669}]
[null,null,1416,156,null,"1969-05-01",{"$f":"'Índices INSS'!$E$1/VLOOKUP(F51,'Índices INSS'!A:D,4,1)","v":2.5357923149529817}]
[null,null,1416,156,null,"1969-06-01",{"$f":"'Índices INSS'!$E$1/VLOOKUP(F52,'Índices INSS'!A:D,4,1)","v":2.5048197181738185}]
[null,null,1416,156,null,"1969-07-01",{"$f":"'Índices INSS'!$E$1/VLOOKUP(F53,'Índices INSS'!A:D,4,1)","v":2.4714221548837965}]
[null,null,1416,156,null,"1969-08-01",{"$f":"'Índices INSS'!$E$1/VLOOKUP(F54,'Índices INSS'!A:D,4,1)","v":2.4544298913033145}]
[null,null,1416,156,null,"1969-09-01",{"$f":"'Índices INSS'!$E$1/VLOOKUP(F55,'Índices INSS'!A:D,4,1)","v":2.4364372892099566}]
[null,null,1416,156,null,"1969-10-01",{"$f":"'Índices INSS'!$E$1/VLOOKUP(F56,'Índices INSS'!A:D,4,1)","v":2.4144654125095784}]
[null,null,1416,156,null,"1969-11-01",{"$f":"'Índices INSS'!$E$1/VLOOKUP(F57,'Índices INSS'!A:D,4,1)","v":2.3757815124548802}]
[null,null,1416,156,null,"1969-12-01",{"$f":"'Índices INSS'!$E$1/VLOOKUP(F58,'Índices INSS'!A:D,4,1)","v":2.3270270381674196}]
[null,null,1416,156,null,"1970-01-01",{"$f":"'Índices INSS'!$E$1/VLOOKUP(F59,'Índices INSS'!A:D,4,1)","v":2.2759259014937703}]
[null,null,1416,156,null,"1970-02-01",{"$f":"'Índices INSS'!$E$1/VLOOKUP(F60,'Índices INSS'!A:D,4,1)","v":2.2259922213844519}]
[null,null,1416,156,null,"1970-03-01",{"$f":"'Índices INSS'!$E$1/VLOOKUP(F61,'Índices INSS'!A:D,4,1)","v":2.1821476381791021}]
[null,null,1416,156,null,"1970-04-01",{"$f":"'Índices INSS'!$E$1/VLOOKUP(F62,'Índices INSS'!A:D,4,1)","v":2.1577224359760963}]
[null,null,1704,187,null,"1970-05-01",{"$f":"'Índices INSS'!$E$1/VLOOKUP(F63,'Índices INSS'!A:D,4,1)","v":2.1380981162261268}]
[null,null,1704,187,null,"1970-06-01",{"$f":"'Índices INSS'!$E$1/VLOOKUP(F64,'Índices INSS'!A:D,4,1)","v":2.1183617633493541}]
[null,null,1704,187,null,"1970-07-01",{"$f":"'Índices INSS'!$E$1/VLOOKUP(F65,'Índices INSS'!A:D,4,1)","v":2.0862654046056579}]
[null,null,1704,187,null,"1970-08-01",{"$f":"'Índices INSS'!$E$1/VLOOKUP(F66,'Índices INSS'!A:D,4,1)","v":2.0679137044356439}]
[null,null,1704,187,null,"1970-09-01",{"$f":"'Índices INSS'!$E$1/VLOOKUP(F67,'Índices INSS'!A:D,4,1)","v":2.0485751549727018}]
[null,null,1704,187,null,"1970-10-01",{"$f":"'Índices INSS'!$E$1/VLOOKUP(F68,'Índices INSS'!A:D,4,1)","v":2.024479396302036}]
[null,null,1704,187,null,"1970-11-01",{"$f":"'Índices INSS'!$E$1/VLOOKUP(F69,'Índices INSS'!A:D,4,1)","v":1.9869194654941211}]
[null,null,1704,187,null,"1970-12-01",{"$f":"'Índices INSS'!$E$1/VLOOKUP(F70,'Índices INSS'!A:D,4,1)","v":1.9456089346670165}]
[null,null,1704,187,null,"1971-01-01",{"$f":"'Índices INSS'!$E$1/VLOOKUP(F71,'Índices INSS'!A:D,4,1)","v":1.9082453008518081}]
[null,null,1704,187,null,"1971-02-01",{"$f":"'Índices INSS'!$E$1/VLOOKUP(F72,'Índices INSS'!A:D,4,1)","v":1.8737455235235869}]
[null,null,1704,187,null,"1971-03-01",{"$f":"'Índices INSS'!$E$1/VLOOKUP(F73,'Índices INSS'!A:D,4,1)","v":1.849299084140607}]
[null,null,1704,187,null,"1971-04-01",{"$f":"'Índices INSS'!$E$1/VLOOKUP(F74,'Índices INSS'!A:D,4,1)","v":1.8310308889614388}]
[null,null,2088,225.6,null,"1971-05-01",{"$f":"'Índices INSS'!$E$1/VLOOKUP(F75,'Índices INSS'!A:D,4,1)","v":1.8100556026270758}]
[null,null,2088,225.6,null,"1971-06-01",{"$f":"'Índices INSS'!$E$1/VLOOKUP(F76,'Índices INSS'!A:D,4,1)","v":1.7845854635161345}]
[null,null,2088,225.6,null,"1971-07-01",{"$f":"'Índices INSS'!$E$1/VLOOKUP(F77,'Índices INSS'!A:D,4,1)","v":1.7499174979801504}]
[null,null,2088,225.6,null,"1971-08-01",{"$f":"'Índices INSS'!$E$1/VLOOKUP(F78,'Índices INSS'!A:D,4,1)","v":1.7156541685794502}]
[null,null,2088,225.6,null,"1971-09-01",{"$f":"'Índices INSS'!$E$1/VLOOKUP(F79,'Índices INSS'!A:D,4,1)","v":1.6803600540403913}]
[null,null,2088,225.6,null,"1971-10-01",{"$f":"'Índices INSS'!$E$1/VLOOKUP(F80,'Índices INSS'!A:D,4,1)","v":1.6445222952772505}]
{"$rows_left_out":579}
{"sheet":"Índices INSS","index":1,"n_rows":1634,"n_cols":5,"rows_kept":1634,"cut":false,"hidden":false,"merged":[[0,0,0,3]]}
["INSS",null,null,null,{"$f":"VLOOKUP(RMI!D3,A:D,4,1)","v":8.5296871750375359E-3}]
["Data","Variação Mensal %","Índices Mensais","Variação Acumulada"]
["1964-01-01"]
["1964-02-01"]
["1964-03-01"]
["1964-04-01"]
["1964-05-01"]
["1964-06-01"]
["1964-07-01"]
["1964-08-01"]
["1964-09-01"]
["1964-10-01"]
["1964-11-01",0]
["1964-12-01",0]
["1965-01-01",0.13,{"$f":"B15+1","v":1.1299999999999999},1]
["1965-02-01",0,{"$f":"B16+1","v":1},{"$f":"D15*C16","v":1}]
["1965-03-01",0,1,{"$f":"D16*C17","v":1}]
["1965-04-01",0.1858407,1.1858407,1.1858407]
["1965-05-01",0,1,1.1858407]
["1965-06-01",0,1,1.1858407]
["1965-07-01",0.13432840000000001,1.1343284,1.34513278388588]
["1965-08-01",0,1,1.34513278388588]
["1965-09-01",3.2894699999999999E-2,1.0328946999999999,1.3893805232719707]
["1965-10-01",1.2738899999999999E-2,1.0127389,1.40707970281988]
["1965-11-01",9.4339999999999997E-3,1.0094339999999999,1.4203540927362828]
["1965-12-01",1.5576300000000001E-2,1.0155763,1.4424779541909709]
["1966-01-01",1.8404899999999998E-2,1.0184048999999999,1.4690266166900603]
["1966-02-01",5.4216899999999998E-2,1.0542168999999999,1.5486726858644835]
["1966-03-01",-1.1428600000000001E-2,0.98857139999999999,1.5309735252068126]
["1966-04-01",1.7340999999999999E-2,1.0173410000000001,1.5575221371074239]
["1966-05-01",3.8636400000000001E-2,1.0386363999999999,1.6176991854055611]
["1966-06-01",4.4310700000000001E-2,1.0443107,1.6893805687003114]
["1966-07-01",4.0859100000000002E-2,1.0408591,1.7584071382948943]
["1966-08-01",2.8183199999999999E-2,1.0281832,1.8079646783548868]
["1966-09-01",2.8389600000000001E-2,1.0283895999999999,1.8592920723875106]
["1966-10-01",2.8557800000000001E-2,1.0285578,1.9123893635323386]
["1966-11-01",2.6376699999999999E-2,1.0263766999999999,1.9628318840574219]
["1966-12-01",2.2993700000000002E-2,1.0229937,2.007964651549873]
["1967-01-01",2.3799000000000001E-2,1.0237989999999999,2.0557522022921084]
["1967-02-01",2.3676300000000001E-2,1.0236763,{"$f":"(D39/1000)*C40","v":2.1044248081592372E-3}]
["1967-03-01",2.1026099999999999E-2,1.0210261,{"$f":"D40*C41","v":2.1486726546180741E-3}]
["1967-04-01",1.4827E-2,1.0148269999999999,{"$f":"D41*C42","v":2.1805310240680959E-3}]
["1967-05-01",1.50162E-2,1.0150162,2.2132743140317072E-3]
["1967-06-01",1.79928E-2,1.0179928,2.2530973161092168E-3]
["1967-07-01",2.8279700000000001E-2,1.0282796999999999,2.3168142322795905E-3]
["1967-08-01",2.5210099999999999E-2,1.0252101,2.3752213507567824E-3]
["1967-09-01",1.5275700000000001E-2,1.0152756999999999,2.4115045195445377E-3]
["1967-10-01",4.7705999999999998E-3,1.0047706000000001,2.423008843005477E-3]
["1967-11-01",6.9394000000000001E-3,1.0069394,2.4398230705706295E-3]
["1967-12-01",1.41458E-2,1.0141458000000001,2.4743363197623075E-3]
["1968-01-01",1.8598E-2,1.0185979999999999,2.5203540266372465E-3]
["1968-02-01",1.7556200000000001E-2,1.0175562,2.5646018659996953E-3]
["1968-03-01",1.4492799999999998E-2,1.0144928,2.6017701279232555E-3]
["1968-04-01",1.4625900000000001E-2,1.0146259,2.6398233576372483E-3]
["1968-05-01",1.8773100000000001E-2,1.0187731,2.6893810255125081E-3]
["1968-06-01",2.66535E-2,1.0266535000000001,2.761062442676006E-3]
["1968-07-01",2.8525599999999998E-2,1.0285256,2.8398234054908046E-3]
["1968-08-01",2.2436899999999999E-2,1.0224369,2.9035402392574611E-3]
["1968-09-01",1.8287100000000001E-2,1.0182871,2.9566375699667862E-3]
["1968-10-01",1.40676E-2,1.0140676,2.9982303646460509E-3]
["1968-11-01",1.50531E-2,1.0150531,3.0433630261481044E-3]
["1968-12-01",1.6283800000000001E-2,1.0162838000000001,3.0929205409932952E-3]
["1969-01-01",1.9170199999999998E-2,1.0191702,3.152212446348245E-3]
["1969-02-01",1.8248200000000003E-2,1.0182481999999999,3.2097346495116967E-3]
["1969-03-01",1.7645399999999999E-2,1.0176453999999999,3.2663717012961901E-3]
["1969-04-01",1.40883E-2,1.0140883000000001,3.3123893257355616E-3]
["1969-05-01",1.54956E-2,1.0154955999999999,3.3637167857714294E-3]
["1969-06-01",1.23652E-2,1.0123652000000001,3.4053098165708505E-3]
["1969-07-01",1.3513500000000001E-2,1.0135135,3.4513274707770806E-3]
["1969-08-01",6.9230999999999997E-3,1.0069231000000001,3.4752213559900175E-3]
["1969-09-01",7.3848000000000004E-3,1.0073848000000001,3.5008851706597329E-3]
["1969-10-01",9.1000999999999999E-3,1.0091000999999999,3.5327435758012535E-3]
["1969-11-01",1.6282600000000001E-2,1.0162826,3.5902658263485951E-3]
["1969-12-01",2.0951399999999998E-2,1.0209514,3.6654869217827546E-3]
["1970-01-01",2.2452899999999998E-2,1.0224529,3.7477877330888507E-3]
["1970-02-01",2.24321E-2,1.0224321000000001,3.8318584822962733E-3]
["1970-03-01",2.00924E-2,1.0200924,3.908849715665963E-3]
["1970-04-01",1.1319900000000001E-2,1.0113198999999999,3.9530975035623299E-3]
["1970-05-01",9.1783999999999998E-3,{"$f":"B79+1","v":1.0091783999999999},3.9893806136890256E-3]
["1970-06-01",9.3168000000000001E-3,1.0093167999999999,4.0265488749906429E-3]
{"$rows_left_out":1554}